Reaction Details
TargetCannabinoid receptor 1
LigandBDBM50254765
Substrate/Competitorn/a
Meas. Tech.ChEMBL_558495 (CHEMBL963901)
IC50 18.9±n/a nM
Citation Kim, JYSeo, HJLee, SHJung, MEAhn, KKim, JLee, J Diarylimidazolyl oxadiazole and thiadiazole derivatives as cannabinoid CB1 receptor antagonists. Bioorg Med Chem Lett19:142-5 (2008) 
 
Cannabinoid receptor 1
Name:Cannabinoid receptor 1
Type:G Protein-Coupled Receptor (GPCR)
Mol. Mass.:52856.55
Organism:Rattus norvegicus (rat)
Description:P20272
Residue:473
BDBM50254765
NameBDBM50254765
Synonyms:2-tert-butyl-5-(1-(4-chlorophenyl)-2-(2,4-dichlorophenyl)-5-propyl-1H-imidazol-4-yl)-1,3,4-oxadiazole | CHEMBL518558
TypeSmall organic molecule
Emp. Form.C24H23Cl3N4O
Mol. Mass.489.825
SMILESCCCc1c(nc(-c2ccc(Cl)cc2Cl)n1-c1ccc(Cl)cc1)-c1nnc(o1)C(C)(C)C