Reaction Details
TargetCannabinoid receptor 1
LigandBDBM50254792
Substrate/Competitorn/a
Meas. Tech.ChEMBL_558495 (CHEMBL963901)
IC50 79.9±n/a nM
Citation Kim, JYSeo, HJLee, SHJung, MEAhn, KKim, JLee, J Diarylimidazolyl oxadiazole and thiadiazole derivatives as cannabinoid CB1 receptor antagonists. Bioorg Med Chem Lett19:142-5 (2008) 
 
Cannabinoid receptor 1
Name:Cannabinoid receptor 1
Type:G Protein-Coupled Receptor (GPCR)
Mol. Mass.:52856.55
Organism:Rattus norvegicus (rat)
Description:P20272
Residue:473
BDBM50254792
NameBDBM50254792
Synonyms:2-tert-butyl-5-(1-(4-chlorophenyl)-5-cyclopropyl-2-(2,4-dichlorophenyl)-1H-imidazol-4-yl)-1,3,4-oxadiazole | CHEMBL480792
TypeSmall organic molecule
Emp. Form.C24H21Cl3N4O
Mol. Mass.487.809
SMILESCC(C)(C)c1nnc(o1)-c1nc(-c2ccc(Cl)cc2Cl)n(c1C1CC1)-c1ccc(Cl)cc1