Reaction Details
TargetCannabinoid receptor 1
LigandBDBM50254835
Substrate/Competitorn/a
Meas. Tech.ChEMBL_558495 (CHEMBL963901)
IC50 5.29±n/a nM
Citation Kim, JYSeo, HJLee, SHJung, MEAhn, KKim, JLee, J Diarylimidazolyl oxadiazole and thiadiazole derivatives as cannabinoid CB1 receptor antagonists. Bioorg Med Chem Lett19:142-5 (2008) 
 
Cannabinoid receptor 1
Name:Cannabinoid receptor 1
Type:G Protein-Coupled Receptor (GPCR)
Mol. Mass.:52856.55
Organism:Rattus norvegicus (rat)
Description:P20272
Residue:473
BDBM50254835
NameBDBM50254835
Synonyms:2-tert-butyl-5-(2-(2-chlorophenyl)-1-(4-chlorophenyl)-5-methyl-1H-imidazol-4-yl)-1,3,4-oxadiazole | CHEMBL518295
TypeSmall organic molecule
Emp. Form.C22H20Cl2N4O
Mol. Mass.427.326
SMILESCc1c(nc(-c2ccccc2Cl)n1-c1ccc(Cl)cc1)-c1nnc(o1)C(C)(C)C