Reaction Details
TargetCannabinoid receptor 1
LigandBDBM50254877
Substrate/Competitorn/a
Meas. Tech.ChEMBL_558495 (CHEMBL963901)
IC50 15.8±n/a nM
Citation Kim, JYSeo, HJLee, SHJung, MEAhn, KKim, JLee, J Diarylimidazolyl oxadiazole and thiadiazole derivatives as cannabinoid CB1 receptor antagonists. Bioorg Med Chem Lett19:142-5 (2008) 
 
Cannabinoid receptor 1
Name:Cannabinoid receptor 1
Type:G Protein-Coupled Receptor (GPCR)
Mol. Mass.:52856.55
Organism:Rattus norvegicus (rat)
Description:P20272
Residue:473
BDBM50254877
NameBDBM50254877
Synonyms:2-tert-butyl-5-(1-(4-chlorophenyl)-2-(2,4-dichlorophenyl)-5-ethyl-1H-imidazol-4-yl)-1,3,4-thiadiazole | CHEMBL518620
TypeSmall organic molecule
Emp. Form.C23H21Cl3N4S
Mol. Mass.491.864
SMILESCCc1c(nc(-c2ccc(Cl)cc2Cl)n1-c1ccc(Cl)cc1)-c1nnc(s1)C(C)(C)C