Reaction Details
TargetCannabinoid receptor 1
LigandBDBM50254960
Substrate/Competitorn/a
Meas. Tech.ChEMBL_558495 (CHEMBL963901)
IC50 10.7±n/a nM
Citation Kim, JYSeo, HJLee, SHJung, MEAhn, KKim, JLee, J Diarylimidazolyl oxadiazole and thiadiazole derivatives as cannabinoid CB1 receptor antagonists. Bioorg Med Chem Lett19:142-5 (2008) 
 
Cannabinoid receptor 1
Name:Cannabinoid receptor 1
Type:G Protein-Coupled Receptor (GPCR)
Mol. Mass.:52856.55
Organism:Rattus norvegicus (rat)
Description:P20272
Residue:473
BDBM50254960
NameBDBM50254960
Synonyms:2-(1-(4-bromophenyl)-2-(2-chlorophenyl)-5-methyl-1H-imidazol-4-yl)-5-tert-butyl-1,3,4-thiadiazole | CHEMBL463879
TypeSmall organic molecule
Emp. Form.C22H20BrClN4S
Mol. Mass.487.843
SMILESCc1c(nc(-c2ccccc2Cl)n1-c1ccc(Br)cc1)-c1nnc(s1)C(C)(C)C