Reaction Details
TargetCannabinoid receptor 2
LigandBDBM50254962
Substrate/Competitorn/a
Meas. Tech.ChEMBL_558496 (CHEMBL963902)
IC50>10000±n/a nM
Citation Kim, JYSeo, HJLee, SHJung, MEAhn, KKim, JLee, J Diarylimidazolyl oxadiazole and thiadiazole derivatives as cannabinoid CB1 receptor antagonists. Bioorg Med Chem Lett19:142-5 (2008) 
 
Cannabinoid receptor 2
Name:Cannabinoid receptor 2
Type:G Protein-Coupled Receptor (GPCR)
Mol. Mass.:39690.94
Organism:Homo sapiens (Human)
Description:P34972
Residue:360
BDBM50254962
NameBDBM50254962
Synonyms:2-(1-(4-bromophenyl)-2-(2,4-dichlorophenyl)-5-ethyl-1H-imidazol-4-yl)-5-(1-p-tolylcyclopropyl)-1,3,4-oxadiazole | CHEMBL464058
TypeSmall organic molecule
Emp. Form.C29H23BrCl2N4O
Mol. Mass.594.329
SMILESCCc1c(nc(-c2ccc(Cl)cc2Cl)n1-c1ccc(Br)cc1)-c1nnc(o1)C1(CC1)c1ccc(C)cc1