Reaction Details
TargetProstaglandin E2 receptor EP3 subtype
LigandBDBM50254838
Substrate/Competitorn/a
Meas. Tech.ChEMBL_558515 (CHEMBL963081)
IC50 2.8±n/a nM
Citation Zhou, NZeller, WKrohn, MAnderson, HZhang, JOnua, EKiselyov, ASRamirez, JHalldorsdottir, GAndrésson, TGurney, MESingh, J 3,4-Disubstituted indole acylsulfonamides: a novel series of potent and selective human EP3 receptor antagonists. Bioorg Med Chem Lett19:123-6 (2008) 
 
Prostaglandin E2 receptor EP3 subtype
Name:Prostaglandin E2 receptor EP3 subtype
Type:Enzyme
Mol. Mass.:43335.03
Organism:Homo sapiens (Human)
Description:P43115
Residue:390
BDBM50254838
NameBDBM50254838
Synonyms:CHEMBL481582 | N-(4,5-dichlorothiophen-2-ylsulfonyl)-2-(3-(pyridin-2-ylthio)-1H-indol-4-yloxy)acetamide
TypeSmall organic molecule
Emp. Form.C19H13Cl2N3O4S3
Mol. Mass.514.425
SMILESClc1cc(sc1Cl)S(=O)(=O)NC(=O)COc1cccc2[nH]cc(Sc3ccccn3)c12