Reaction Details
TargetProstaglandin E2 receptor EP3 subtype
LigandBDBM50255058
Substrate/Competitorn/a
Meas. Tech.ChEMBL_558515 (CHEMBL963081)
IC50 1.7±n/a nM
Citation Zhou, NZeller, WKrohn, MAnderson, HZhang, JOnua, EKiselyov, ASRamirez, JHalldorsdottir, GAndrésson, TGurney, MESingh, J 3,4-Disubstituted indole acylsulfonamides: a novel series of potent and selective human EP3 receptor antagonists. Bioorg Med Chem Lett19:123-6 (2008) 
 
Prostaglandin E2 receptor EP3 subtype
Name:Prostaglandin E2 receptor EP3 subtype
Type:Enzyme
Mol. Mass.:43335.03
Organism:Homo sapiens (Human)
Description:P43115
Residue:390
BDBM50255058
NameBDBM50255058
Synonyms:CHEMBL479427 | N-(4,5-dichlorothiophen-2-ylsulfonyl)-2-(3-(naphthalen-2-ylsulfonyl)-1H-indol-4-yloxy)acetamide
TypeSmall organic molecule
Emp. Form.C24H16Cl2N2O6S3
Mol. Mass.595.495
SMILESClc1cc(sc1Cl)S(=O)(=O)NC(=O)COc1cccc2[nH]cc(c12)S(=O)(=O)c1ccc2ccccc2c1