Reaction Details
TargetProstaglandin E2 receptor EP3 subtype
LigandBDBM50254475
Substrate/Competitorn/a
Meas. Tech.ChEMBL_558515 (CHEMBL963081)
IC50 6.1±n/a nM
Citation Zhou, NZeller, WKrohn, MAnderson, HZhang, JOnua, EKiselyov, ASRamirez, JHalldorsdottir, GAndrésson, TGurney, MESingh, J 3,4-Disubstituted indole acylsulfonamides: a novel series of potent and selective human EP3 receptor antagonists. Bioorg Med Chem Lett19:123-6 (2008) 
 
Prostaglandin E2 receptor EP3 subtype
Name:Prostaglandin E2 receptor EP3 subtype
Type:Enzyme
Mol. Mass.:43335.03
Organism:Homo sapiens (Human)
Description:P43115
Residue:390
BDBM50254475
NameBDBM50254475
Synonyms:CHEMBL466595 | N-(4,5-dichlorothiophen-2-ylsulfonyl)-2-(3-(2,5-dimethoxyphenylsulfonyl)-1H-indol-4-yloxy)acetamide
TypeSmall organic molecule
Emp. Form.C22H18Cl2N2O8S3
Mol. Mass.605.488
SMILESCOc1ccc(OC)c(c1)S(=O)(=O)c1c[nH]c2cccc(OCC(=O)NS(=O)(=O)c3cc(Cl)c(Cl)s3)c12