Reaction Details
TargetProstaglandin E2 receptor EP3 subtype
LigandBDBM50254520
Substrate/Competitorn/a
Meas. Tech.ChEMBL_558516 (CHEMBL963082)
IC50 0.7±n/a nM
Citation Zhou, NZeller, WKrohn, MAnderson, HZhang, JOnua, EKiselyov, ASRamirez, JHalldorsdottir, GAndrésson, TGurney, MESingh, J 3,4-Disubstituted indole acylsulfonamides: a novel series of potent and selective human EP3 receptor antagonists. Bioorg Med Chem Lett19:123-6 (2008) 
 
Prostaglandin E2 receptor EP3 subtype
Name:Prostaglandin E2 receptor EP3 subtype
Type:Enzyme
Mol. Mass.:43335.03
Organism:Homo sapiens (Human)
Description:P43115
Residue:390
BDBM50254520
NameBDBM50254520
Synonyms:CHEMBL466184 | N-(3,4-difluorophenylsulfonyl)-2-(3-(naphthalen-2-ylthio)-1H-indol-4-yloxy)acetamide
TypeSmall organic molecule
Emp. Form.C26H18F2N2O4S2
Mol. Mass.524.559
SMILESFc1ccc(cc1F)S(=O)(=O)NC(=O)COc1cccc2[nH]cc(Sc3ccc4ccccc4c3)c12