Reaction Details
TargetNeuronal acetylcholine receptor subunit alpha-3
LigandBDBM50254482
Substrate/Competitorn/a
Meas. Tech.ChEMBL_558774 (CHEMBL1020767)
Ki 1400±n/a nM
Citation Hansen, CPJensen, AABalle, TBitsch-Jensen, KHassan, MMLiljefors, TFrølund, B Carbamoylcholine analogs as nicotinic acetylcholine receptor agonists--structural modifications of 3-(dimethylamino)butyl dimethylcarbamate (DMABC). Bioorg Med Chem Lett19:87-91 (2008) 
 
Neuronal acetylcholine receptor subunit alpha-3
Name:Neuronal acetylcholine receptor subunit alpha-3
Type:Enzyme Catalytic Domain
Mol. Mass.:57479.03
Organism:Homo sapiens (Human)
Description:Cholinergic, Nicotinic Alpha3Beta2 0 HUMAN::P32297
Residue:505
BDBM50254482
NameBDBM50254482
Synonyms:3-(dimethylamino)butyl benzyl(methyl)carbamate | CHEMBL500318
TypeSmall organic molecule
Emp. Form.C15H24N2O2
Mol. Mass.264.3633
SMILESCC(CCOC(=O)N(C)Cc1ccccc1)N(C)C