Reaction Details
TargetBaculoviral IAP repeat-containing protein 2
LigandBDBM50273673
Substrate/Competitorn/a
Meas. Tech.ChEMBL_538134 (CHEMBL1025777)
Ki 1.2±n/a nM
Citation Peng, YSun, HNikolovska-Coleska, ZQiu, SYang, CYLu, JCai, QYi, HKang, SYang, DWang, S Potent, orally bioavailable diazabicyclic small-molecule mimetics of second mitochondria-derived activator of caspases. J Med Chem51:8158-62 (2008) 
 
Baculoviral IAP repeat-containing protein 2
Name:Baculoviral IAP repeat-containing protein 2
Type:Protein
Mol. Mass.:69900.47
Organism:Homo sapiens (Human)
Description:Q13490
Residue:618
BDBM50273673
NameBDBM50273673
Synonyms:(5S,8S,10aR)-N-Benzhydryl-5-((S)-2-(methylamino)propanamido)-6-oxodeca-hydropyrrolo[1,2-a][1,5]diazocine-8-carboxamide | CHEMBL459541
TypeSmall organic molecule
Emp. Form.C27H35N5O3
Mol. Mass.477.5985
SMILESCN[C@@H](C)C(=O)N[C@H]1CNCC[C@H]2CC[C@H](N2C1=O)C(=O)NC(c1ccccc1)c1ccccc1