Reaction Details
TargetCaspase-7
LigandBDBM10331
Substrate/Competitorn/a
Meas. Tech.ChEMBL_537866 (CHEMBL990677)
EC50 19.8±n/a nM
Citation Smith, GGlaser, MPerumal, MNguyen, QDShan, BArstad, EAboagye, EO Design, synthesis, and biological characterization of a caspase 3/7 selective isatin labeled with 2-[18F]fluoroethylazide. J Med Chem51:8057-67 (2008) 
 
Caspase-7
Name:Caspase-7
Type:Enzyme
Mol. Mass.:34273.91
Organism:Homo sapiens (Human)
Description:P55210
Residue:303
BDBM10331
NameBDBM10331
Synonyms:(S)-1-(4-Fluorobenzyl)-5-(2-phenoxymethyl-pyrrolidine-1-sulfonyl)-1H-indole-2,3-dione CHEMBL372607 | Pyrrolidine Isatin Analogue 11c
TypeSmall organic molecule
Emp. Form.C26H23FN2O5S
Mol. Mass.494.535
SMILESFc1ccc(CN2C(=O)C(=O)c3cc(ccc23)S(=O)(=O)N2CCC[C@H]2COc2ccccc2)cc1