Reaction Details
TargetCaspase-7
LigandBDBM50273928
Substrate/Competitorn/a
Meas. Tech.ChEMBL_537866 (CHEMBL990677)
EC50 13.5±n/a nM
Citation Smith, GGlaser, MPerumal, MNguyen, QDShan, BArstad, EAboagye, EO Design, synthesis, and biological characterization of a caspase 3/7 selective isatin labeled with 2-[18F]fluoroethylazide. J Med Chem51:8057-67 (2008) 
 
Caspase-7
Name:Caspase-7
Type:Enzyme
Mol. Mass.:34273.91
Organism:Homo sapiens (Human)
Description:P55210
Residue:303
BDBM50273928
NameBDBM50273928
Synonyms:(S)-1-(4-Fluorobenzyl)-5-(2-(3-fluorophenoxymethyl)-pyrrolidine-1-sulfonyl)isatin | CHEMBL461249
TypeSmall organic molecule
Emp. Form.C26H22F2N2O5S
Mol. Mass.512.525
SMILESFc1ccc(CN2C(=O)C(=O)c3cc(ccc23)S(=O)(=O)N2CCC[C@H]2COc2cccc(F)c2)cc1