Reaction Details
TargetCaspase-7
LigandBDBM50273992
Substrate/Competitorn/a
Meas. Tech.ChEMBL_537866 (CHEMBL990677)
EC50 60.4±n/a nM
Citation Smith, GGlaser, MPerumal, MNguyen, QDShan, BArstad, EAboagye, EO Design, synthesis, and biological characterization of a caspase 3/7 selective isatin labeled with 2-[18F]fluoroethylazide. J Med Chem51:8057-67 (2008) 
 
Caspase-7
Name:Caspase-7
Type:Enzyme
Mol. Mass.:34273.91
Organism:Homo sapiens (Human)
Description:P55210
Residue:303
BDBM50273992
NameBDBM50273992
Synonyms:(S)-1-(2-Propynyl)-5-(2-(2,4-difluorophenoxymethyl)-pyrrolidine-1-sulfonyl)isatin | CHEMBL515661
TypeSmall organic molecule
Emp. Form.C22H18F2N2O5S
Mol. Mass.460.451
SMILESFc1ccc(OC[C@@H]2CCCN2S(=O)(=O)c2ccc3N(CC#C)C(=O)C(=O)c3c2)c(F)c1