Reaction Details
TargetCaspase-1
LigandBDBM50273990
Substrate/Competitorn/a
Meas. Tech.ChEMBL_537867 (CHEMBL990679)
EC50>5000±n/a nM
Citation Smith, GGlaser, MPerumal, MNguyen, QDShan, BArstad, EAboagye, EO Design, synthesis, and biological characterization of a caspase 3/7 selective isatin labeled with 2-[18F]fluoroethylazide. J Med Chem51:8057-67 (2008) 
 
Caspase-1
Name:Caspase-1
Type:Enzyme
Mol. Mass.:45154.13
Organism:Homo sapiens (Human)
Description:P29466
Residue:404
BDBM50273990
NameBDBM50273990
Synonyms:(S)-1-(4-Fluorobenzyl)-5-(2-(tetrahydro-2H-pyran-4-yloxymethyl)-pyrrolidine-1-sulfonyl)isatin | CHEMBL456593
TypeSmall organic molecule
Emp. Form.C25H27FN2O6S
Mol. Mass.502.555
SMILESFc1ccc(CN2C(=O)C(=O)c3cc(ccc23)S(=O)(=O)N2CCC[C@H]2COC2CCOCC2)cc1