Reaction Details
TargetCaspase-6
LigandBDBM50273338
Substrate/Competitorn/a
Meas. Tech.ChEMBL_537868 (CHEMBL990680)
EC50>5000±n/a nM
Citation Smith, GGlaser, MPerumal, MNguyen, QDShan, BArstad, EAboagye, EO Design, synthesis, and biological characterization of a caspase 3/7 selective isatin labeled with 2-[18F]fluoroethylazide. J Med Chem51:8057-67 (2008) 
 
Caspase-6
Name:Caspase-6
Type:Enzyme
Mol. Mass.:33312.62
Organism:Homo sapiens (Human)
Description:P55212
Residue:293
BDBM50273338
NameBDBM50273338
Synonyms:(S)-1-((1-(2-Fluoroethyl)-1H-[1,2,3]-triazol-4-yl)methyl)-5-(2(2,4-difluorophenoxymethyl)-pyrrolidine-1-sulfonyl)isatin | CHEMBL456799
TypeSmall organic molecule
Emp. Form.C24H22F3N5O5S
Mol. Mass.549.522
SMILESFCCn1cc(CN2C(=O)C(=O)c3cc(ccc23)S(=O)(=O)N2CCC[C@H]2COc2ccc(F)cc2F)nn1