Reaction Details
TargetCaspase-8
LigandBDBM50273929
Substrate/Competitorn/a
Meas. Tech.ChEMBL_537869 (CHEMBL990681)
EC50>5000±n/a nM
Citation Smith, GGlaser, MPerumal, MNguyen, QDShan, BArstad, EAboagye, EO Design, synthesis, and biological characterization of a caspase 3/7 selective isatin labeled with 2-[18F]fluoroethylazide. J Med Chem51:8057-67 (2008) 
 
Caspase-8
Name:Caspase-8
Type:Enzyme
Mol. Mass.:55373.89
Organism:Homo sapiens (Human)
Description:Q14790
Residue:479
BDBM50273929
NameBDBM50273929
Synonyms:(S)-1-(4-Fluorobenzyl)-5-(2-(2,4-difluorophenoxymethyl)-pyrrolidine-1-sulfonyl)isatin | CHEMBL516941
TypeSmall organic molecule
Emp. Form.C26H21F3N2O5S
Mol. Mass.530.516
SMILESFc1ccc(CN2C(=O)C(=O)c3cc(ccc23)S(=O)(=O)N2CCC[C@H]2COc2ccc(F)cc2F)cc1