Reaction Details
TargetCytochrome P450 2C9
LigandBDBM50273785
Substrate/Competitorn/a
Meas. Tech.ChEMBL_561228 (CHEMBL1012774)
Ki 33±n/a nM
Citation Peng, CCCape, JLRushmore, TCrouch, GJJones, JP Cytochrome P450 2C9 type II binding studies on quinoline-4-carboxamide analogues. J Med Chem51:8000-11 (2008) 
 
Cytochrome P450 2C9
Name:Cytochrome P450 2C9
Type:Enzyme
Mol. Mass.:55636.33
Organism:Homo sapiens (Human)
Description:P11712
Residue:490
BDBM50273785
NameBDBM50273785
Synonyms:CHEMBL456181 | N-(Naphthalen-2-yl)-2-(pyridin-4-yl)quinoline-4-carboxamide
TypeSmall organic molecule
Emp. Form.C25H17N3O
Mol. Mass.375.422
SMILESO=C(Nc1ccc2ccccc2c1)c1cc(nc2ccccc12)-c1ccncc1