Reaction Details
TargetCytochrome P450 2C9
LigandBDBM50273448
Substrate/Competitorn/a
Meas. Tech.ChEMBL_561228 (CHEMBL1012774)
Ki 8550±n/a nM
Citation Peng, CCCape, JLRushmore, TCrouch, GJJones, JP Cytochrome P450 2C9 type II binding studies on quinoline-4-carboxamide analogues. J Med Chem51:8000-11 (2008) 
 
Cytochrome P450 2C9
Name:Cytochrome P450 2C9
Type:Enzyme
Mol. Mass.:55636.33
Organism:Homo sapiens (Human)
Description:P11712
Residue:490
BDBM50273448
NameBDBM50273448
Synonyms:6,8-Dimethyl-N-(naphthalen-2-yl)-2-(pyridin-3-yl)quinoline-4-carboxamide | CHEMBL516696
TypeSmall organic molecule
Emp. Form.C27H21N3O
Mol. Mass.403.4751
SMILESCc1cc(C)c2nc(cc(C(=O)Nc3ccc4ccccc4c3)c2c1)-c1cccnc1