Reaction Details
TargetCytochrome P450 2C9
LigandBDBM50273712
Substrate/Competitorn/a
Meas. Tech.ChEMBL_561228 (CHEMBL1012774)
Ki 9740±n/a nM
Citation Peng, CCCape, JLRushmore, TCrouch, GJJones, JP Cytochrome P450 2C9 type II binding studies on quinoline-4-carboxamide analogues. J Med Chem51:8000-11 (2008) 
 
Cytochrome P450 2C9
Name:Cytochrome P450 2C9
Type:Enzyme
Mol. Mass.:55636.33
Organism:Homo sapiens (Human)
Description:P11712
Residue:490
BDBM50273712
NameBDBM50273712
Synonyms:CHEMBL457021 | Piperidin-1-yl(2-(pyridin-3-yl)quinolin-4-yl)methanone
TypeSmall organic molecule
Emp. Form.C20H19N3O
Mol. Mass.317.3844
SMILESO=C(N1CCCCC1)c1cc(nc2ccccc12)-c1cccnc1