Reaction Details
TargetNon-receptor tyrosine-protein kinase TNK1
LigandBDBM50193995
Substrate/Competitorn/a
Meas. Tech.ChEMBL_561608 (CHEMBL1017051)
Kd 640±n/a nM
Citation Jiang, JKGhoreschi, KDeflorian, FChen, ZPerreira, MPesu, MSmith, JNguyen, DTLiu, EHLeister, WCostanzi, SO'Shea, JJThomas, CJ Examining the chirality, conformation and selective kinase inhibition of 3-((3R,4R)-4-methyl-3-(methyl(7H-pyrrolo[2,3-d]pyrimidin-4-yl)amino)piperidin-1-yl)-3-oxopropanenitrile (CP-690,550). J Med Chem51:8012-8 (2008) 
 
Non-receptor tyrosine-protein kinase TNK1
Name:Non-receptor tyrosine-protein kinase TNK1
Type:PROTEIN
Mol. Mass.:72495.61
Organism:Homo sapiens (Human)
Description:ChEMBL_774410
Residue:666
BDBM50193995
NameBDBM50193995
Synonyms:3-((3R,4R)-4-methyl-3-(methyl(7H-pyrrolo[2,3-d]pyrimidin-4-yl)amino)piperidin-1-yl)-3-oxopropanenitrile 3-{(3R,4R)-4-methyl-3-[methyl(7H-pyrrolo[2,3-d]pyrimidin-4-yl)amino]piperidin-1-yl}-3-oxopropanenitrile CP-690550 Tofacitinib US10112907, Example 00035 US10766894, Compound TABLE 1.20 US11078206, Example Tofacitinib US11339167, Example Tofacitinib
TypeSmall organic molecule
Emp. Form.C16H20N6O
Mol. Mass.312.3696
SMILESC[C@@H]1CCN(C[C@@H]1N(C)c1ncnc2[nH]ccc12)C(=O)CC#N