Reaction Details
TargetSerine/threonine-protein kinase 4
LigandBDBM50273894
Substrate/Competitorn/a
Meas. Tech.ChEMBL_561611 (CHEMBL1017054)
Kd 250±n/a nM
Citation Jiang, JKGhoreschi, KDeflorian, FChen, ZPerreira, MPesu, MSmith, JNguyen, DTLiu, EHLeister, WCostanzi, SO'Shea, JJThomas, CJ Examining the chirality, conformation and selective kinase inhibition of 3-((3R,4R)-4-methyl-3-(methyl(7H-pyrrolo[2,3-d]pyrimidin-4-yl)amino)piperidin-1-yl)-3-oxopropanenitrile (CP-690,550). J Med Chem51:8012-8 (2008) 
 
Serine/threonine-protein kinase 4
Name:Serine/threonine-protein kinase 4
Type:Enzyme
Mol. Mass.:55611.40
Organism:Homo sapiens (Human)
Description:Q13043
Residue:487
BDBM50273894
NameBDBM50273894
Synonyms:3-((3R,4S)-3-((1H-Indol-4-yl)(methyl)amino)-4-methylpiperidin-1-yl)-3-oxopropane-nitrile | CHEMBL457871
TypeSmall organic molecule
Emp. Form.C16H20N6O
Mol. Mass.312.3696
SMILESC[C@H]1CCN(C[C@@H]1N(C)c1ncnc2[nH]ccc12)C(=O)CC#N