Reaction Details
TargetAdenosine receptor A2a
LigandBDBM50266020
Substrate/Competitorn/a
Meas. Tech.ChEMBL_540180 (CHEMBL1029809)
Ki 43±n/a nM
Citation Cole, AGStauffer, TMRokosz, LLMetzger, ADillard, LWZeng, WHenderson, I Synthesis of 2-amino-5-benzoyl-4-(2-furyl)thiazoles as adenosine A(2A) receptor antagonists. Bioorg Med Chem Lett19:378-81 (2008) 
 
Adenosine receptor A2a
Name:Adenosine receptor A2a
Type:G Protein-Coupled Receptor (GPCR)
Mol. Mass.:44716.46
Organism:Homo sapiens (Human)
Description:P29274
Residue:412
BDBM50266020
NameBDBM50266020
Synonyms:(4-(furan-2-yl)-2-(furan-2-ylmethylamino)thiazol-5-yl)(phenyl)methanone | CHEMBL516871
TypeSmall organic molecule
Emp. Form.C19H14N2O3S
Mol. Mass.350.391
SMILESO=C(c1sc(NCc2ccco2)nc1-c1ccco1)c1ccccc1