Reaction Details
TargetTranscription factor Jun
LigandBDBM50279429
Substrate/Competitorn/a
Meas. Tech.ChEMBL_545230 (CHEMBL1019824)
IC50 3300±n/a nM
Citation Giri, RSThaker, HMGiordano, TWilliams, JRogers, DSudersanam, VVasu, KK Design, synthesis and characterization of novel 2-(2,4-disubstituted-thiazole-5-yl)-3-aryl-3H-quinazoline-4-one derivatives as inhibitors of NF-kappaB and AP-1 mediated transcription activation and as potential anti-inflammatory agents. Eur J Med Chem44:2184-9 (2009) 
 
Transcription factor Jun
Name:Transcription factor Jun
Type:n/a
Mol. Mass.:35683.24
Organism:Homo sapiens (Human)
Description:P05412
Residue:331
BDBM50279429
NameBDBM50279429
Synonyms:3-(4-Chloro-phenyl)-2-(4-methyl-2-methylamino-thiazol-5-yl)-3H-quinazolin-4-one | CHEMBL487336
TypeSmall organic molecule
Emp. Form.C19H15ClN4OS
Mol. Mass.382.867
SMILESCNc1nc(C)c(s1)-c1nc2ccccc2c(=O)n1-c1ccc(Cl)cc1