Reaction Details
TargetTranscription factor Jun
LigandBDBM50279431
Substrate/Competitorn/a
Meas. Tech.ChEMBL_545230 (CHEMBL1019824)
IC50 3300±n/a nM
Citation Giri, RSThaker, HMGiordano, TWilliams, JRogers, DSudersanam, VVasu, KK Design, synthesis and characterization of novel 2-(2,4-disubstituted-thiazole-5-yl)-3-aryl-3H-quinazoline-4-one derivatives as inhibitors of NF-kappaB and AP-1 mediated transcription activation and as potential anti-inflammatory agents. Eur J Med Chem44:2184-9 (2009) 
 
Transcription factor Jun
Name:Transcription factor Jun
Type:n/a
Mol. Mass.:35683.24
Organism:Homo sapiens (Human)
Description:P05412
Residue:331
BDBM50279431
NameBDBM50279431
Synonyms:3-(4-Chloro-phenyl)-2-[2-(4-chloro-phenylamino)-4-methyl-thiazol-5-yl]-3H-quinazolin-4-one | CHEMBL485904
TypeSmall organic molecule
Emp. Form.C24H16Cl2N4OS
Mol. Mass.479.381
SMILESCc1nc(Nc2ccc(Cl)cc2)sc1-c1nc2ccccc2c(=O)n1-c1ccc(Cl)cc1