Reaction Details
TargetTranscription factor Jun
LigandBDBM50279699
Substrate/Competitorn/a
Meas. Tech.ChEMBL_545230 (CHEMBL1019824)
IC50 5500±n/a nM
Citation Giri, RSThaker, HMGiordano, TWilliams, JRogers, DSudersanam, VVasu, KK Design, synthesis and characterization of novel 2-(2,4-disubstituted-thiazole-5-yl)-3-aryl-3H-quinazoline-4-one derivatives as inhibitors of NF-kappaB and AP-1 mediated transcription activation and as potential anti-inflammatory agents. Eur J Med Chem44:2184-9 (2009) 
 
Transcription factor Jun
Name:Transcription factor Jun
Type:n/a
Mol. Mass.:35683.24
Organism:Homo sapiens (Human)
Description:P05412
Residue:331
BDBM50279699
NameBDBM50279699
Synonyms:2-(4-Methyl-2-phenylamino-thiazol-5-yl)-3-o-tolyl-3H-quinazolin-4-one | CHEMBL474718
TypeSmall organic molecule
Emp. Form.C25H20N4OS
Mol. Mass.424.517
SMILESCc1nc(Nc2ccccc2)sc1-c1nc2ccccc2c(=O)n1-c1ccccc1C