Reaction Details
TargetAdenosine receptor A3
LigandBDBM50254006
Substrate/Competitorn/a
Meas. Tech.ChEMBL_560535 (CHEMBL1021385)
Ki 1048±n/a nM
Citation Gillespie, RJBamford, SJBotting, RComer, MDenny, SGaur, SGriffin, MJordan, AMKnight, ARLerpiniere, JLeonardi, SLightowler, SMcAteer, SMerrett, AMisra, APadfield, AReece, MSaadi, MSelwood, DLStratton, GCSurry, DTodd, RTong, XRuston, VUpton, RWeiss, SM Antagonists of the human A(2A) adenosine receptor. 4. Design, synthesis, and preclinical evaluation of 7-aryltriazolo[4,5-d]pyrimidines. J Med Chem52:33-47 (2009) 
 
Adenosine receptor A3
Name:Adenosine receptor A3
Type:G Protein-Coupled Receptor (GPCR)
Mol. Mass.:36197.32
Organism:Homo sapiens (Human)
Description:P0DMS8
Residue:318
BDBM50254006
NameBDBM50254006
Synonyms:3-(4-Cyanobenzyl)-7-(2-furyl)-3H-[1,2,3]triazolo[4,5-d]pyrimidine-5-amine CHEMBL461007
TypeSmall organic molecule
Emp. Form.C16H11N7O
Mol. Mass.317.3048
SMILESNc1nc(-c2ccco2)c2nnn(Cc3ccc(cc3)C#N)c2n1