Reaction Details
TargetAdenosine receptor A1
LigandBDBM50254264
Substrate/Competitorn/a
Meas. Tech.ChEMBL_560533 (CHEMBL1021383)
Ki 599±n/a nM
Citation Gillespie, RJBamford, SJBotting, RComer, MDenny, SGaur, SGriffin, MJordan, AMKnight, ARLerpiniere, JLeonardi, SLightowler, SMcAteer, SMerrett, AMisra, APadfield, AReece, MSaadi, MSelwood, DLStratton, GCSurry, DTodd, RTong, XRuston, VUpton, RWeiss, SM Antagonists of the human A(2A) adenosine receptor. 4. Design, synthesis, and preclinical evaluation of 7-aryltriazolo[4,5-d]pyrimidines. J Med Chem52:33-47 (2009) 
 
Adenosine receptor A1
Name:Adenosine receptor A1
Type:G Protein-Coupled Receptor (GPCR)
Mol. Mass.:36520.92
Organism:Homo sapiens (Human)
Description:P30542
Residue:326
BDBM50254264
NameBDBM50254264
Synonyms:3-(2-Fluorobenzyl)-7-(2-oxazolyl)-3H-[1,2,3]triazolo[4,5-d]pyrimidine-5-amine CHEMBL468701
TypeSmall organic molecule
Emp. Form.C14H10FN7O
Mol. Mass.311.2739
SMILESNc1nc(-c2ncco2)c2nnn(Cc3ccccc3F)c2n1