Reaction Details
TargetAdenosine receptor A2a
LigandBDBM50254262
Substrate/Competitorn/a
Meas. Tech.ChEMBL_560532 (CHEMBL1021382)
Ki 2.2±n/a nM
Citation Gillespie, RJBamford, SJBotting, RComer, MDenny, SGaur, SGriffin, MJordan, AMKnight, ARLerpiniere, JLeonardi, SLightowler, SMcAteer, SMerrett, AMisra, APadfield, AReece, MSaadi, MSelwood, DLStratton, GCSurry, DTodd, RTong, XRuston, VUpton, RWeiss, SM Antagonists of the human A(2A) adenosine receptor. 4. Design, synthesis, and preclinical evaluation of 7-aryltriazolo[4,5-d]pyrimidines. J Med Chem52:33-47 (2009) 
 
Adenosine receptor A2a
Name:Adenosine receptor A2a
Type:G Protein-Coupled Receptor (GPCR)
Mol. Mass.:44716.46
Organism:Homo sapiens (Human)
Description:P29274
Residue:412
BDBM50254262
NameBDBM50254262
Synonyms:3-(2-Fluorobenzyl)-7-(4-methyl-2-thiazolyl)-3H-[1,2,3]triazolo[4,5-d]pyrimidine-5-amine | CHEMBL505787
TypeSmall organic molecule
Emp. Form.C15H12FN7S
Mol. Mass.341.366
SMILESCc1csc(n1)-c1nc(N)nc2n(Cc3ccccc3F)nnc12