Reaction Details
TargetD(3) dopamine receptor
LigandBDBM50176070
Substrate/Competitorn/a
Meas. Tech.ChEMBL_494292 (CHEMBL938624)
Ki 0.13±n/a nM
Citation Leopoldo, MLacivita, EDe Giorgio, PContino, MBerardi, FPerrone, R Design, synthesis, and binding affinities of potential positron emission tomography (PET) ligands with optimal lipophilicity for brain imaging of the dopamine D3 receptor. Part II. Bioorg Med Chem17:758-66 (2009) 
 
D(3) dopamine receptor
Name:D(3) dopamine receptor
Type:n/a
Mol. Mass.:44243.43
Organism:Homo sapiens (Human)
Description:n/a
Residue:400
BDBM50176070
NameBDBM50176070
Synonyms:7-Methoxy-benzofuran-2-carboxylic acid {4-[4-(2,3-dichloro-phenyl)-piperazin-1-yl]-butyl}-amide N-(4-(4-(2,3-dichlorophenyl)piperazin-1-yl)butyl)-7-methoxybenzofuran-2-carboxamide
TypeSmall organic molecule
Emp. Form.C24H27Cl2N3O3
Mol. Mass.476.395
SMILESCOc1cccc2cc(oc12)C(=O)NCCCCN1CCN(CC1)c1cccc(Cl)c1Cl