Reaction Details
TargetD(3) dopamine receptor
LigandBDBM50122041
Substrate/Competitorn/a
Meas. Tech.ChEMBL_494292 (CHEMBL938624)
Ki 0.6±n/a nM
Citation Leopoldo, MLacivita, EDe Giorgio, PContino, MBerardi, FPerrone, R Design, synthesis, and binding affinities of potential positron emission tomography (PET) ligands with optimal lipophilicity for brain imaging of the dopamine D3 receptor. Part II. Bioorg Med Chem17:758-66 (2009) 
 
D(3) dopamine receptor
Name:D(3) dopamine receptor
Type:n/a
Mol. Mass.:44243.43
Organism:Homo sapiens (Human)
Description:n/a
Residue:400
BDBM50122041
NameBDBM50122041
Synonyms:1-Methoxy-naphthalene-2-carboxylic acid {4-[4-(2,3-dichloro-phenyl)-piperazin-1-yl]-butyl}-amide N-(4-(4-(2,3-dichlorophenyl)piperazin-1-yl)butyl)-1-methoxy-2-naphthamide
TypeSmall organic molecule
Emp. Form.C26H29Cl2N3O2
Mol. Mass.486.433
SMILESCOc1c(ccc2ccccc12)C(=O)NCCCCN1CCN(CC1)c1cccc(Cl)c1Cl