Reaction Details
TargetMacrophage migration inhibitory factor
LigandBDBM50096003
Substrate/Competitorn/a
Meas. Tech.ChEMBL_558850 (CHEMBL1021636)
Ki 470±n/a nM
Citation Cournia, ZLeng, LGandavadi, SDu, XBucala, RJorgensen, WL Discovery of human macrophage migration inhibitory factor (MIF)-CD74 antagonists via virtual screening. J Med Chem52:416-24 (2009) 
 
Macrophage migration inhibitory factor
Name:Macrophage migration inhibitory factor
Type:Enzyme
Mol. Mass.:12478.18
Organism:Homo sapiens (Human)
Description:P14174
Residue:115
BDBM50096003
NameBDBM50096003
Synonyms:7-Hydroxy-3-phenyl-chromen-2-one CHEMBL153505 | cid_5393176
TypeSmall organic molecule
Emp. Form.C15H10O3
Mol. Mass.238.2381
SMILESOc1ccc2cc(-c3ccccc3)c(=O)oc2c1