Reaction Details
TargetMacrophage migration inhibitory factor
LigandBDBM50096006
Substrate/Competitorn/a
Meas. Tech.ChEMBL_558850 (CHEMBL1021636)
Ki 2100±n/a nM
Citation Cournia, ZLeng, LGandavadi, SDu, XBucala, RJorgensen, WL Discovery of human macrophage migration inhibitory factor (MIF)-CD74 antagonists via virtual screening. J Med Chem52:416-24 (2009) 
 
Macrophage migration inhibitory factor
Name:Macrophage migration inhibitory factor
Type:Enzyme
Mol. Mass.:12478.18
Organism:Homo sapiens (Human)
Description:P14174
Residue:115
BDBM50096006
NameBDBM50096006
Synonyms:7-Hydroxy-3-(2-methyl-thiazol-4-yl)-chromen-2-one CHEMBL358206
TypeSmall organic molecule
Emp. Form.C13H9NO3S
Mol. Mass.259.28
SMILESCc1nc(cs1)-c1cc2ccc(O)cc2oc1=O