Reaction Details
TargetMacrophage migration inhibitory factor
LigandBDBM50095995
Substrate/Competitorn/a
Meas. Tech.ChEMBL_558850 (CHEMBL1021636)
Ki 7400±n/a nM
Citation Cournia, ZLeng, LGandavadi, SDu, XBucala, RJorgensen, WL Discovery of human macrophage migration inhibitory factor (MIF)-CD74 antagonists via virtual screening. J Med Chem52:416-24 (2009) 
 
Macrophage migration inhibitory factor
Name:Macrophage migration inhibitory factor
Type:Enzyme
Mol. Mass.:12478.18
Organism:Homo sapiens (Human)
Description:P14174
Residue:115
BDBM50095995
NameBDBM50095995
Synonyms:7-HYDROXY-2-OXO-CHROMENE-3-CARBOXYLIC ACID ETHYL ESTER CHEMBL155103 | ethyl 7-hydroxy-2-oxo-2H-chromene-3-carboxylate
TypeSmall organic molecule
Emp. Form.C12H10O5
Mol. Mass.234.2048
SMILESCCOC(=O)c1cc2ccc(O)cc2oc1=O