Reaction Details
TargetMu-type opioid receptor
LigandBDBM50277113
Substrate/Competitorn/a
Meas. Tech.ChEMBL_540508 (CHEMBL1030612)
IC50 11000±n/a nM
Citation Wentland, MPLu, QGanorkar, RZhang, SZJo, SCohen, DJBidlack, JM Redefining the structure-activity relationships of 2,6-methano-3-benzazocines. Part 7: syntheses and opioid receptor properties of cyclic variants of cyclazocine. Bioorg Med Chem Lett19:365-8 (2008) 
 
Mu-type opioid receptor
Name:Mu-type opioid receptor
Type:G Protein-Coupled Receptor (GPCR)
Mol. Mass.:44789.51
Organism:Homo sapiens (Human)
Description:P35372
Residue:400
BDBM50277113
NameBDBM50277113
Synonyms:(1S,16R)-13-(cyclopropylmethyl)-1,6,16-trimethyl-5,7,13-triazatetracyclo[10.3.1.0^{2,10}.0^{4,8}]hexadeca-2,4(8),6,9-tetraene | CHEMBL473699
TypeSmall organic molecule
Emp. Form.C20H27N3
Mol. Mass.309.4485
SMILESC[C@H]1C2Cc3cc4[nH]c(C)nc4cc3[C@@]1(C)CCN2CC1CC1