Reaction Details
TargetCannabinoid receptor 1
LigandBDBM50277266
Substrate/Competitorn/a
Meas. Tech.ChEMBL_540511 (CHEMBL1030615)
Ki 1100±n/a nM
Citation Goodman, AJAjello, CWWorm, KLe Bourdonnec, BSavolainen, MAO'Hare, HCassel, JAStabley, GJDehaven, RNLabuda, CJKoblish, MLittle, PJBrogdon, BLSmith, SADolle, RE CB2 selective sulfamoyl benzamides: optimization of the amide functionality. Bioorg Med Chem Lett19:309-13 (2008) 
 
Cannabinoid receptor 1
Name:Cannabinoid receptor 1
Type:G Protein-Coupled Receptor (GPCR)
Mol. Mass.:52868.96
Organism:Homo sapiens (Human)
Description:P21554
Residue:472
BDBM50277266
NameBDBM50277266
Synonyms:4-(2-methyl-5-(4-neopentyl-1H-imidazol-2-yl)phenylsulfonyl)morpholine | CHEMBL474300
TypeSmall organic molecule
Emp. Form.C19H27N3O3S
Mol. Mass.377.501
SMILESCc1ccc(cc1S(=O)(=O)N1CCOCC1)-c1nc(CC(C)(C)C)c[nH]1