Reaction Details
TargetCannabinoid receptor 2
LigandBDBM50277268
Substrate/Competitorn/a
Meas. Tech.ChEMBL_540514 (CHEMBL1031455)
EC50 130±n/a nM
Citation Goodman, AJAjello, CWWorm, KLe Bourdonnec, BSavolainen, MAO'Hare, HCassel, JAStabley, GJDehaven, RNLabuda, CJKoblish, MLittle, PJBrogdon, BLSmith, SADolle, RE CB2 selective sulfamoyl benzamides: optimization of the amide functionality. Bioorg Med Chem Lett19:309-13 (2008) 
 
Cannabinoid receptor 2
Name:Cannabinoid receptor 2
Type:G Protein-Coupled Receptor (GPCR)
Mol. Mass.:39690.94
Organism:Homo sapiens (Human)
Description:P34972
Residue:360
BDBM50277268
NameBDBM50277268
Synonyms:4-(5-(2-tert-butyl-1H-imidazol-5-yl)-2-methylphenylsulfonyl)morpholine | CHEMBL475719
TypeSmall organic molecule
Emp. Form.C18H25N3O3S
Mol. Mass.363.474
SMILESCc1ccc(cc1S(=O)(=O)N1CCOCC1)-c1c[nH]c(n1)C(C)(C)C