Reaction Details
TargetCannabinoid receptor 2
LigandBDBM50277305
Substrate/Competitorn/a
Meas. Tech.ChEMBL_540514 (CHEMBL1031455)
EC50 190±n/a nM
Citation Goodman, AJAjello, CWWorm, KLe Bourdonnec, BSavolainen, MAO'Hare, HCassel, JAStabley, GJDehaven, RNLabuda, CJKoblish, MLittle, PJBrogdon, BLSmith, SADolle, RE CB2 selective sulfamoyl benzamides: optimization of the amide functionality. Bioorg Med Chem Lett19:309-13 (2008) 
 
Cannabinoid receptor 2
Name:Cannabinoid receptor 2
Type:G Protein-Coupled Receptor (GPCR)
Mol. Mass.:39690.94
Organism:Homo sapiens (Human)
Description:P34972
Residue:360
BDBM50277305
NameBDBM50277305
Synonyms:4-(5-(5-(cyclohexylmethyl)-1H-pyrazol-3-yl)-2-methylphenylsulfonyl)morpholine | CHEMBL514324
TypeSmall organic molecule
Emp. Form.C21H29N3O3S
Mol. Mass.403.538
SMILESCc1ccc(cc1S(=O)(=O)N1CCOCC1)-c1cc(CC2CCCCC2)[nH]n1