Reaction Details
TargetCannabinoid receptor 1
LigandBDBM50277379
Substrate/Competitorn/a
Meas. Tech.ChEMBL_540511 (CHEMBL1030615)
Ki 2900±n/a nM
Citation Goodman, AJAjello, CWWorm, KLe Bourdonnec, BSavolainen, MAO'Hare, HCassel, JAStabley, GJDehaven, RNLabuda, CJKoblish, MLittle, PJBrogdon, BLSmith, SADolle, RE CB2 selective sulfamoyl benzamides: optimization of the amide functionality. Bioorg Med Chem Lett19:309-13 (2008) 
 
Cannabinoid receptor 1
Name:Cannabinoid receptor 1
Type:G Protein-Coupled Receptor (GPCR)
Mol. Mass.:52868.96
Organism:Homo sapiens (Human)
Description:P21554
Residue:472
BDBM50277379
NameBDBM50277379
Synonyms:(1S,2R,4R)-1,4-dimethyl-N-(4-methyl-3-(morpholinosulfonyl)phenyl)-7-oxabicyclo[2.2.1]heptane-2-carboxamide | CHEMBL525791
TypeSmall organic molecule
Emp. Form.C20H28N2O5S
Mol. Mass.408.512
SMILESCc1ccc(NC(=O)[C@@H]2C[C@@]3(C)CC[C@]2(C)O3)cc1S(=O)(=O)N1CCOCC1