Reaction Details
TargetCannabinoid receptor 1
LigandBDBM50277308
Substrate/Competitorn/a
Meas. Tech.ChEMBL_540511 (CHEMBL1030615)
Ki 1200±n/a nM
Citation Goodman, AJAjello, CWWorm, KLe Bourdonnec, BSavolainen, MAO'Hare, HCassel, JAStabley, GJDehaven, RNLabuda, CJKoblish, MLittle, PJBrogdon, BLSmith, SADolle, RE CB2 selective sulfamoyl benzamides: optimization of the amide functionality. Bioorg Med Chem Lett19:309-13 (2008) 
 
Cannabinoid receptor 1
Name:Cannabinoid receptor 1
Type:G Protein-Coupled Receptor (GPCR)
Mol. Mass.:52868.96
Organism:Homo sapiens (Human)
Description:P21554
Residue:472
BDBM50277308
NameBDBM50277308
Synonyms:2-tert-butyl-3,3-dimethyl-N-(4-methyl-3-(morpholinosulfonyl)phenyl)butanamide | CHEMBL471671
TypeSmall organic molecule
Emp. Form.C21H34N2O4S
Mol. Mass.410.571
SMILESCc1ccc(NC(=O)C(C(C)(C)C)C(C)(C)C)cc1S(=O)(=O)N1CCOCC1