Reaction Details
TargetCannabinoid receptor 1
LigandBDBM50277154
Substrate/Competitorn/a
Meas. Tech.ChEMBL_540511 (CHEMBL1030615)
Ki 790±n/a nM
Citation Goodman, AJAjello, CWWorm, KLe Bourdonnec, BSavolainen, MAO'Hare, HCassel, JAStabley, GJDehaven, RNLabuda, CJKoblish, MLittle, PJBrogdon, BLSmith, SADolle, RE CB2 selective sulfamoyl benzamides: optimization of the amide functionality. Bioorg Med Chem Lett19:309-13 (2008) 
 
Cannabinoid receptor 1
Name:Cannabinoid receptor 1
Type:G Protein-Coupled Receptor (GPCR)
Mol. Mass.:52868.96
Organism:Homo sapiens (Human)
Description:P21554
Residue:472
BDBM50277154
NameBDBM50277154
Synonyms:2,2-dimethyl-N-(4-methyl-3-(morpholinosulfonyl)phenyl)cyclohexanecarboxamide | CHEMBL474692
TypeSmall organic molecule
Emp. Form.C20H30N2O4S
Mol. Mass.394.528
SMILESCc1ccc(NC(=O)C2CCCCC2(C)C)cc1S(=O)(=O)N1CCOCC1