Reaction Details
TargetCannabinoid receptor 2
LigandBDBM50277194
Substrate/Competitorn/a
Meas. Tech.ChEMBL_540512 (CHEMBL1030616)
Ki 5.2±n/a nM
Citation Goodman, AJAjello, CWWorm, KLe Bourdonnec, BSavolainen, MAO'Hare, HCassel, JAStabley, GJDehaven, RNLabuda, CJKoblish, MLittle, PJBrogdon, BLSmith, SADolle, RE CB2 selective sulfamoyl benzamides: optimization of the amide functionality. Bioorg Med Chem Lett19:309-13 (2008) 
 
Cannabinoid receptor 2
Name:Cannabinoid receptor 2
Type:G Protein-Coupled Receptor (GPCR)
Mol. Mass.:39690.94
Organism:Homo sapiens (Human)
Description:P34972
Residue:360
BDBM50277194
NameBDBM50277194
Synonyms:4-(2-methyl-5-(4-neopentylthiazol-2-yl)phenylsulfonyl)morpholine | CHEMBL474897
TypeSmall organic molecule
Emp. Form.C19H26N2O3S2
Mol. Mass.394.551
SMILESCc1ccc(cc1S(=O)(=O)N1CCOCC1)-c1nc(CC(C)(C)C)cs1