Reaction Details
TargetCannabinoid receptor 1
LigandBDBM50256173
Substrate/Competitorn/a
Meas. Tech.ChEMBL_515076 (CHEMBL1034818)
EC50 35.1±n/a nM
Citation Hou, DRAlam, SKuan, TCRamanathan, MLin, TPHung, MS 1,2,3-Triazole derivatives as new cannabinoid CB1 receptor antagonists. Bioorg Med Chem Lett19:1022-5 (2009) 
 
Cannabinoid receptor 1
Name:Cannabinoid receptor 1
Type:G Protein-Coupled Receptor (GPCR)
Mol. Mass.:52868.96
Organism:Homo sapiens (Human)
Description:P21554
Residue:472
BDBM50256173
NameBDBM50256173
Synonyms:2-(4,5-bis(2,4-dichlorophenyl)-2H-1,2,3-triazol-2-yl)-N-(3-fluorobenzyl)acetamide | CHEMBL482153
TypeSmall organic molecule
Emp. Form.C23H15Cl4FN4O
Mol. Mass.524.202
SMILESFc1cccc(CNC(=O)Cn2nc(c(n2)-c2ccc(Cl)cc2Cl)-c2ccc(Cl)cc2Cl)c1