Reaction Details
TargetCannabinoid receptor 2
LigandBDBM50256075
Substrate/Competitorn/a
Meas. Tech.ChEMBL_515077 (CHEMBL1034819)
IC50 5.9±n/a nM
Citation Hou, DRAlam, SKuan, TCRamanathan, MLin, TPHung, MS 1,2,3-Triazole derivatives as new cannabinoid CB1 receptor antagonists. Bioorg Med Chem Lett19:1022-5 (2009) 
 
Cannabinoid receptor 2
Name:Cannabinoid receptor 2
Type:G Protein-Coupled Receptor (GPCR)
Mol. Mass.:39690.94
Organism:Homo sapiens (Human)
Description:P34972
Residue:360
BDBM50256075
NameBDBM50256075
Synonyms:2-(4,5-bis(2,4-dichlorophenyl)-2H-1,2,3-triazol-2-yl)-1-(piperidin-1-yl)ethanone | CHEMBL481886
TypeSmall organic molecule
Emp. Form.C21H18Cl4N4O
Mol. Mass.484.206
SMILESClc1ccc(-c2nn(CC(=O)N3CCCCC3)nc2-c2ccc(Cl)cc2Cl)c(Cl)c1