Reaction Details
TargetCannabinoid receptor 2
LigandBDBM50256121
Substrate/Competitorn/a
Meas. Tech.ChEMBL_515077 (CHEMBL1034819)
IC50>10±n/a nM
Citation Hou, DRAlam, SKuan, TCRamanathan, MLin, TPHung, MS 1,2,3-Triazole derivatives as new cannabinoid CB1 receptor antagonists. Bioorg Med Chem Lett19:1022-5 (2009) 
 
Cannabinoid receptor 2
Name:Cannabinoid receptor 2
Type:G Protein-Coupled Receptor (GPCR)
Mol. Mass.:39690.94
Organism:Homo sapiens (Human)
Description:P34972
Residue:360
BDBM50256121
NameBDBM50256121
Synonyms:2-(4,5-bis(2,4-dichlorophenyl)-2H-1,2,3-triazol-2-yl)-N-cyclohexylacetamide | CHEMBL474601
TypeSmall organic molecule
Emp. Form.C22H20Cl4N4O
Mol. Mass.498.232
SMILESClc1ccc(-c2nn(CC(=O)NC3CCCCC3)nc2-c2ccc(Cl)cc2Cl)c(Cl)c1