Reaction Details
TargetProstaglandin G/H synthase 1
LigandBDBM50247577
Substrate/Competitorn/a
Meas. Tech.ChEMBL_495250 (CHEMBL1003656)
IC50 200±n/a nM
Citation Scholz, MUlbrich, HKSoehnlein, OLindbom, LMattern, ADannhardt, G Diaryl-dithiolanes and -isothiazoles: COX-1/COX-2 and 5-LOX-inhibitory, *OH scavenging and anti-adhesive activities. Bioorg Med Chem17:558-68 (2009) 
 
Prostaglandin G/H synthase 1
Name:Prostaglandin G/H synthase 1
Type:PROTEIN
Mol. Mass.:68814.10
Organism:Bos taurus
Description:ChEMBL_547440
Residue:600
BDBM50247577
NameBDBM50247577
Synonyms:5-(4-Chlorophenyl)-4-p-tolyl-3H-1,2-dithiol-3-one | CHEMBL475545
TypeSmall organic molecule
Emp. Form.C16H11ClOS2
Mol. Mass.318.841
SMILESCc1ccc(cc1)-c1c(ssc1=O)-c1ccc(Cl)cc1