Reaction Details
TargetProstaglandin G/H synthase 1
LigandBDBM32020
Substrate/Competitorn/a
Meas. Tech.ChEMBL_495250 (CHEMBL1003656)
IC50 50000±n/a nM
Citation Scholz, MUlbrich, HKSoehnlein, OLindbom, LMattern, ADannhardt, G Diaryl-dithiolanes and -isothiazoles: COX-1/COX-2 and 5-LOX-inhibitory, *OH scavenging and anti-adhesive activities. Bioorg Med Chem17:558-68 (2009) 
 
Prostaglandin G/H synthase 1
Name:Prostaglandin G/H synthase 1
Type:PROTEIN
Mol. Mass.:68814.10
Organism:Bos taurus
Description:ChEMBL_547440
Residue:600
BDBM32020
NameBDBM32020
Synonyms:4-[4-(3,4-dihydroxyphenyl)-2,3-dimethyl-butyl]pyrocatechol 4-[4-[3,4-bis(oxidanyl)phenyl]-2,3-dimethyl-butyl]benzene-1,2-diol CHEMBL52 MLS000069451 Nordihydroguaiaretic acid (NDGA) US10857082, Compound 2.18 | cid_4534
TypeSmall organic molecule
Emp. Form.C18H22O4
Mol. Mass.302.3649
SMILESCC(Cc1ccc(O)c(O)c1)C(C)Cc1ccc(O)c(O)c1