Reaction Details
TargetCarbonyl reductase [NADPH] 1
LigandBDBM50247677
Substrate/Competitorn/a
Meas. Tech.ChEMBL_495288 (CHEMBL1004505)
IC50 210±n/a nM
Citation Zimmermann, TJNiesen, FHPilka, ESKnapp, SOppermann, UMaier, ME Discovery of a potent and selective inhibitor for human carbonyl reductase 1 from propionate scanning applied to the macrolide zearalenone. Bioorg Med Chem17:530-6 (2009) 
 
Carbonyl reductase [NADPH] 1
Name:Carbonyl reductase [NADPH] 1
Type:PROTEIN
Mol. Mass.:30380.63
Organism:Homo sapiens (Human)
Description:ChEMBL_607770
Residue:277
BDBM50247677
NameBDBM50247677
Synonyms:(3S,8S)-14,16-dihydroxy-3,8-dimethyl-3,4,5,6,9,10-hexahydro-1H-benzo[c][1]oxacyclotetradecine-1,7(8H)-dione | CHEMBL453375
TypeSmall organic molecule
Emp. Form.C19H24O5
Mol. Mass.332.3909
SMILESC[C@H]1CCCC(=O)[C@@H](C)CC\C=C\c2cc(O)cc(O)c2C(=O)O1