Reaction Details
TargetVascular endothelial growth factor receptor 2
LigandBDBM50247728
Substrate/Competitorn/a
Meas. Tech.ChEMBL_496178 (CHEMBL1001090)
IC50 1480±n/a nM
Citation Honda, TTerao, TAono, HBan, M Synthesis of novel 1,4-benzoxazin-3-one derivatives as inhibitors against tyrosine kinases. Bioorg Med Chem17:699-708 (2009) 
 
Vascular endothelial growth factor receptor 2
Name:Vascular endothelial growth factor receptor 2
Type:Receptor Tyrosine Kinase
Mol. Mass.:151510.97
Organism:Homo sapiens (Human)
Description:P35968
Residue:1356
BDBM50247728
NameBDBM50247728
Synonyms:(E)-3-(5-((Z)-4-Methyl-3-oxo-3,4-dihydrobenzo[b][1,4]oxazin-2-ylidenemethyl)thiophen-2-yl)-N-(pyridin-3-ylmethyl)acrylamide | CHEMBL461776
TypeSmall organic molecule
Emp. Form.C23H19N3O3S
Mol. Mass.417.48
SMILESCN1C(=O)\C(Oc2ccccc12)=C\c1ccc(\C=C\C(=O)NCc2cccnc2)s1